arabitol, acetylated

Kovats' RI, non-polar column, isothermal

View large format table.

Column type Active phase Temperature (C) I Reference Comment
CapillaryOV-101200.1822.8Adam, 1981Column length: 50. m

Van Den Dool and Kratz RI, non-polar column, custom temperature program

View large format table.

Column type Active phase I Reference Comment
CapillaryDB-11823.Yang and Cashman, 199230. m/0.32 mm/1.0 μm, He; Program: 3 min at 100 0C; 100 - 200 0C at 8 deg/min; 1 min at 200 0C; 200 - 280 0C at 5 deg/min; 30 min at 280 0C

References

Adam, 1981
Adam, S., Separation of mono- and di-saccharide derivatives by high-resolution gas chromatography, Z. Lebensm. Unters. Forsch., 1981, 173, 2, 109-112, https://doi.org/10.1007/BF01042273 . [all data]

Yang and Cashman, 1992
Yang, Z.C.; Cashman, J.R., Structure-retention index relationships for derivatized monosaccharides on non-polar gas chromatography columns, J. Chromatogr., 1992, 596, 1, 79-84, https://doi.org/10.1016/0021-9673(92)80205-9 . [all data]