1-Methyl-2-norbornanone dimethyl ketal

Reaction thermochemistry data

Data compiled by: Hussein Y. Afeefy, Joel F. Liebman, and Stephen E. Stein

Individual Reactions

1-Methyl-2-norbornanone dimethyl ketal + Water = Bicyclo[2.2.1]heptan-2-one, 1-methyl + 2Methyl Alcohol

By formula: C10H18O2 + H2O = C8H12O + 2CH4O

Quantity Value Units Method Reference Comment
Δr10.91 ± 0.23kJ/molCmWiberg and Cunningham, 1990liquid phase; Heat of hydrolysis

References

Wiberg and Cunningham, 1990
Wiberg, K.B.; Cunningham, W.C., Jr., Thermochemical studies of carbonyl reactions. 4. Enthalpies of hydrolysis of norbornyl ketals, J. Org. Chem., 1990, 55, 679-684. [all data]