3,4-Dimethylbenzophenone

Phase change data

Data compiled as indicated in comments:
BS - Robert L. Brown and Stephen E. Stein
AC - William E. Acree, Jr., James S. Chickos

Quantity Value Units Method Reference Comment
Δsub107.9 ± 0.8kJ/molCGomes, Amaral, et al., 2008AC

Reduced pressure boiling point

Tboil (K) Pressure (bar) Reference Comment
613.20.992Weast and Grasselli, 1989BS

References

Gomes, Amaral, et al., 2008
Gomes, José R.B.; Amaral, Luísa M.P.F.; Ribeiro da Silva, Manuel A.V., Standard molar enthalpies of formation of dimethylbenzophenones, J. Phys. Org. Chem., 2008, 21, 5, 365-371, https://doi.org/10.1002/poc.1342 . [all data]

Weast and Grasselli, 1989
CRC Handbook of Data on Organic Compounds, 2nd Editon, Weast,R.C and Grasselli, J.G., ed(s)., CRC Press, Inc., Boca Raton, FL, 1989, 1. [all data]