Propane, 2-cyclohexyl-2-phenyl-

Phase change data

Data compiled by: Thermodynamics Research Center, NIST Boulder Laboratories, Chris Muzny director

Quantity Value Units Method Reference Comment
Tboil555.13KN/ASerijan and Wise, 1951Uncertainty assigned by TRC = 0.3 K

In addition to the Thermodynamics Research Center (TRC) data available from this site, much more physical and chemical property data is available from the following TRC products:

References

Serijan and Wise, 1951
Serijan, K.T.; Wise, P.H., Dicylic Hydrocarbons. III. Diphenyl- and Dicyclohexylalkanes through C15, J. Am. Chem. Soc., 1951, 73, 4766. [all data]