1,8-Naphthyridine

Gas phase ion energetics data

Data compiled by: Sharon G. Lias, Rhoda D. Levin, and Sherif A. Kafafi

Ionization energy determinations

IE (eV) Method Reference Comment
8.8PEVan Den Ham and Van Der Meer, 1972
9.20PEVan Den Ham and Van Der Meer, 1972Vertical value

References

Van Den Ham and Van Der Meer, 1972
Van Den Ham, D.M.W.; Van Der Meer, D., The photoelectron spectra of the diazanaphthalenes, Chem. Phys. Lett., 1972, 12, 447. [all data]