Felbamate

Normal alkane RI, non-polar column, temperature ramp

View large format table.

Column type Active phase I Reference Comment
CapillarySE-542157.Friel, Logan, et al., 199730. m/0.32 mm/0.25 μm, He, 80. C @ 1. min, 15. K/min, 295. C @ 8. min

References

Friel, Logan, et al., 1997
Friel, P.N.; Logan, B.K.; Formoso, E.J., GC-MS analysis and post-mortem distribution of felbamate in humans, J. Epilepsy, 1997, 10, 6, 283-286, https://doi.org/10.1016/S0896-6974(97)00063-7 . [all data]