2-Acetyl-1,4,5,6-tetrahydropyridine

Van Den Dool and Kratz RI, non-polar column, temperature ramp

View large format table.

Column type Active phase I Reference Comment
CapillaryBPX-51061.Hill, Isaacs, et al., 199950. m/0.325 mm/0.5 μm, He, 20. C @ 2. min, 4. K/min, 250. C @ 10. min
CapillaryBPX-51062.Hill, Isaacs, et al., 199950. m/0.325 mm/0.5 μm, He, 20. C @ 2. min, 4. K/min, 250. C @ 10. min

Normal alkane RI, non-polar column, temperature ramp

View large format table.

Column type Active phase I Reference Comment
CapillaryDB-11017.Buttery, Ling, et al., 199730. C @ 25. min, 4. K/min, 200. C @ 20. min; Column length: 60. m; Column diameter: 0.25 mm
CapillaryDB-11017.Buttery and Ling, 1995He, 30. C @ 25. min, 4. K/min, 200. C @ 20. min; Column length: 60. m; Column diameter: 0.25 mm
CapillaryOV-1011018.Roberts and Acree, 199412. m/0.32 mm/0.52 μm, 35. C @ 3. min, 4. K/min; Tend: 225. C
PackedSE-541049.Schieberle, 1991Chromosorb G AW DMCS (100-120 mesh), 50. C @ 2. min, 6. K/min, 230. C @ 10. min; Column length: 3. m

References

Hill, Isaacs, et al., 1999
Hill, V.M.; Isaacs, N.S.; Ledward, D.A.; Ames, J.M., Effect of high hydrostatic pressure on the volatile components of a glucose-lysine model system, J. Agric. Food Chem., 1999, 47, 9, 3675-3681, https://doi.org/10.1021/jf990124z . [all data]

Buttery, Ling, et al., 1997
Buttery, R.G.; Ling, L.C.; Stern, D.J., Studies on popcorn aroma and flavor volatiles, J. Agric. Food Chem., 1997, 45, 3, 837-843, https://doi.org/10.1021/jf9604807 . [all data]

Buttery and Ling, 1995
Buttery, R.G.; Ling, L.C., Volatile flavor components of corn tortillas and related products, J. Agric. Food Chem., 1995, 43, 7, 1878-1882, https://doi.org/10.1021/jf00055a023 . [all data]

Roberts and Acree, 1994
Roberts, D.D.; Acree, T.E., Gas chromatography - olfactometry of glucose - proline Maillard reaction products in American Chemical Society, Symposium Series -- Volume 543, American Chemical Society, Washington, 1994, 71-79. [all data]

Schieberle, 1991
Schieberle, P., Primary odorants in popcorn, J. Agric. Food Chem., 1991, 39, 6, 1141-1144, https://doi.org/10.1021/jf00006a030 . [all data]