Lithium 2-methylpropanoate

Phase change data

Data compiled by: Eugene S. Domalski and Elizabeth D. Hearing

Enthalpy of phase transition

ΔHtrs (kJ/mol) Temperature (K) Initial Phase Final Phase Reference Comment
0.903445.crystaline, IIcrystaline, INgeyi, Abhari, et al., 1993
1.045510.crystaline, IliquidNgeyi, Abhari, et al., 1993Crystal to isotropic liquid.

Entropy of phase transition

ΔStrs (J/mol*K) Temperature (K) Initial Phase Final Phase Reference Comment
2.03445.crystaline, IIcrystaline, INgeyi, Abhari, et al., 1993
2.05510.crystaline, IliquidNgeyi, Abhari, et al., 1993Crystal

References

Ngeyi, Abhari, et al., 1993
Ngeyi, S.P.; Abhari, R.; Westrum, E.F., Thermodynamics of alkali alkanoates IX. Heat capacity and thermodynamic functions of lithium 2-methylpropanoate at temperatures from 7 to 535 K, J. Chem. Thermodynam., 1993, 25, 1197-1203. [all data]