3-(p-Methoxyphenyl)propionic acid

Phase change data

Data compiled by: Thermodynamics Research Center, NIST Boulder Laboratories, Chris Muzny director

Quantity Value Units Method Reference Comment
Tfus376.9KN/AArmstrong, James, et al., 1979Uncertainty assigned by TRC = 0.5 K

In addition to the Thermodynamics Research Center (TRC) data available from this site, much more physical and chemical property data is available from the following TRC products:

References

Armstrong, James, et al., 1979
Armstrong, N.A.; James, K.C.; Wong, C.K., Inter-relationships between solubilities, distribution coefficients and melting points of some substituted benzoic and phenylacetic acids, J. Pharm. Pharmacol., 1979, 31, 1, 627, https://doi.org/10.1111/j.2042-7158.1979.tb13606.x . [all data]