5H-Naphtho[2,3-b]carbazole

Gas phase ion energetics data

Data compiled by: Henry M. Rosenstock, Keith Draxl, Bruce W. Steiner, and John T. Herron

Ionization energy determinations

IE (eV) Method Reference
7.0 ± 0.1EIRiepe and Zander, 1969

References

Riepe and Zander, 1969
Riepe, W.; Zander, M., Massenspektroskopische Untersuchungen an Carbazolen, Z. Naturforsch., 1969, 24a, 2017. [all data]