Hexane, 2,5-dibromo-

Phase change data

Data compiled by: Thermodynamics Research Center, NIST Boulder Laboratories, Chris Muzny director

Quantity Value Units Method Reference Comment
Tboil481.15KN/ADunden and Lemme, 1902Uncertainty assigned by TRC = 5. K
Quantity Value Units Method Reference Comment
Tfus311.15KN/ADunden and Lemme, 1902Uncertainty assigned by TRC = 2. K

In addition to the Thermodynamics Research Center (TRC) data available from this site, much more physical and chemical property data is available from the following TRC products:

References

Dunden and Lemme, 1902
Dunden, P.; Lemme, R., 2,5-Hexanediol and Its Derivatives, Chem. Ber., 1902, 35, 1335. [all data]