1,3-Cyclohexadien-5-yne,1,2-dichloro-

Gas phase ion energetics data

Data compiled by: Henry M. Rosenstock, Keith Draxl, Bruce W. Steiner, and John T. Herron

Ionization energy determinations

IE (eV) Method Reference
9.7 ± 0.2EIGrutzmacher and Hubner, 1969

References

Grutzmacher and Hubner, 1969
Grutzmacher, H.-F.; Hubner, J., Massenspektrometrie instabiler molekule. III: Nachweis und untersuchungen zur stabilitat chlorsubstituierter dehydrobenzole in der gasphase, Org. Mass Spectrom., 1969, 2, 649. [all data]