Difluorosilane thiol

Gas phase ion energetics data

Data compiled by: Henry M. Rosenstock, Keith Draxl, Bruce W. Steiner, and John T. Herron

Ionization energy determinations

IE (eV) Method Reference
10.7 ± 0.3EISharp and Margrave, 1969

Appearance energy determinations

Ion AE (eV) Other Products MethodReferenceComment
SiH2FS+12.3 ± 0.3FEISharp and Margrave, 1969
SiHF2S+11.9 ± 0.3HEISharp and Margrave, 1969

References

Sharp and Margrave, 1969
Sharp, K.G.; Margrave, J.L., Silicon-fluorine chemistry. VII. The reaction of silicon difluoride with hydrogen sulfide, Inorg. Chem., 1969, 8, 2655. [all data]