Benzenamine, 2,6-bis(1-methylethyl)-

Phase change data

Data compiled as indicated in comments:
BS - Robert L. Brown and Stephen E. Stein
AC - William E. Acree, Jr., James S. Chickos

Quantity Value Units Method Reference Comment
Tboil530.2KN/AWeast and Grasselli, 1989BS
Quantity Value Units Method Reference Comment
Δvap69.5 ± 0.3kJ/molN/AVerevkin, 2000AC

Enthalpy of vaporization

ΔvapH (kJ/mol) Temperature (K) Reference Comment
69.2 ± 0.3303.Verevkin, 2000Based on data from 284. - 323. K.; AC

References

Weast and Grasselli, 1989
CRC Handbook of Data on Organic Compounds, 2nd Editon, Weast,R.C and Grasselli, J.G., ed(s)., CRC Press, Inc., Boca Raton, FL, 1989, 1. [all data]

Verevkin, 2000
Verevkin, Sergey P., Thermochemical study of the ortho interactions in alkyl substituted anilines, The Journal of Chemical Thermodynamics, 2000, 32, 2, 247-259, https://doi.org/10.1006/jcht.1999.0587 . [all data]