Tetracosanoic acid, methyl ester

Phase change data

Data compiled as indicated in comments:
BS - Robert L. Brown and Stephen E. Stein
AC - William E. Acree, Jr., James S. Chickos

Reduced pressure boiling point

Tboil (K) Pressure (bar) Reference Comment
505.20.005Aldrich Chemical Company Inc., 1990BS

Enthalpy of vaporization

ΔvapH (kJ/mol) Temperature (K) Method Reference Comment
136.6 ± 2.5467. - 558.CGCChickos, Zhao, et al., 2004AC
146.2437.N/ABureau, Jose, et al., 2001Based on data from 422. - 452. K.; AC
100.8498.AStephenson and Malanowski, 1987Based on data from 483. - 536. K.; AC

Enthalpy of fusion

ΔfusH (kJ/mol) Temperature (K) Method Reference Comment
90.0331.2DSCChickos, Zhao, et al., 2004AC

References

Aldrich Chemical Company Inc., 1990
Aldrich Chemical Company Inc., Catalog Handbook of Fine Chemicals, Aldrich Chemical Company, Inc., Milwaukee WI, 1990, 1. [all data]

Chickos, Zhao, et al., 2004
Chickos, James S.; Zhao, Hui; Nichols, Gary, The vaporization enthalpies and vapor pressures of fatty acid methyl esters C18, C21 to C23, and C25 to C29 by correlation -- gas chromatography, Thermochimica Acta, 2004, 424, 1-2, 111-121, https://doi.org/10.1016/j.tca.2004.05.020 . [all data]

Bureau, Jose, et al., 2001
Bureau, N.; Jose, J.; Mokbel, I.; de Hemptinne, J-C, Vapour pressure measurements and prediction for heavy esters, The Journal of Chemical Thermodynamics, 2001, 33, 11, 1485-1498, https://doi.org/10.1006/jcht.2001.0859 . [all data]

Stephenson and Malanowski, 1987
Stephenson, Richard M.; Malanowski, Stanislaw, Handbook of the Thermodynamics of Organic Compounds, 1987, https://doi.org/10.1007/978-94-009-3173-2 . [all data]