1-Octadecanamine, N-methyl-

Phase change data

Data compiled by: Thermodynamics Research Center, NIST Boulder Laboratories, Chris Muzny director

Quantity Value Units Method Reference Comment
Tfus314.65KN/AAnonymous, 1938Uncertainty assigned by TRC = 2. K
Tfus314.65KN/AAnonymous, 1935Uncertainty assigned by TRC = 2. K

In addition to the Thermodynamics Research Center (TRC) data available from this site, much more physical and chemical property data is available from the following TRC products:

References

Anonymous, 1938
Anonymous, P., , 1938. [all data]

Anonymous, 1935
Anonymous, P., , 1935. [all data]