5-Hexen-3-one

Condensed phase thermochemistry data

Data compiled by: Hussein Y. Afeefy, Joel F. Liebman, and Stephen E. Stein

Quantity Value Units Method Reference Comment
Δcliquid-3591.kJ/molCcbRoth-Greifswald, 1911Heat of combustion corrected for pressure; Corresponding Δfliquid = -200. kJ/mol (simple calculation by NIST; no Washburn corrections)

References

Roth-Greifswald, 1911
Roth-Greifswald, W.A., XVIII. Hauptversammlung der Deutschen Bunsen-Gesellschaft fur angewandte physikalische Chemie, Z. Electrochem., 1911, 17, 789-840. [all data]