Eicosanedioic acid

Phase change data

Data compiled as indicated in comments:
BS - Robert L. Brown and Stephen E. Stein
ALS - Hussein Y. Afeefy, Joel F. Liebman, and Stephen E. Stein
AC - William E. Acree, Jr., James S. Chickos

Quantity Value Units Method Reference Comment
Δsub166. ± 3.kJ/molVDavies and Thomas, 1960ALS
Δsub170.0 ± 3.3kJ/molN/ADavies and Thomas, 1960See also Ribeiro da Silva, Monte, et al., 1999.; AC

Reduced pressure boiling point

Tboil (K) Pressure (bar) Reference Comment
506.70.003Weast and Grasselli, 1989BS

Enthalpy of sublimation

ΔsubH (kJ/mol) Temperature (K) Method Reference Comment
199.5341.AStephenson and Malanowski, 1987Based on data from 336. - 346. K.; AC
165.7 ± 3.3388.MEDavies and Thomas, 1960Based on data from 380. - 395. K. See also Stephenson and Malanowski, 1987.; AC

References

Davies and Thomas, 1960
Davies, M.; Thomas, G.H., The lattice energies, infra-red spectra, and possible cyclization of some dicarboxylic acids, Trans. Faraday Soc., 1960, 56, 185. [all data]

Ribeiro da Silva, Monte, et al., 1999
Ribeiro da Silva, Manuel A.V.; Monte, Manuel J.S.; Ribeiro, José R., Vapour pressures and the enthalpies and entropies of sublimation of five dicarboxylic acids, The Journal of Chemical Thermodynamics, 1999, 31, 8, 1093-1107, https://doi.org/10.1006/jcht.1999.0522 . [all data]

Weast and Grasselli, 1989
CRC Handbook of Data on Organic Compounds, 2nd Editon, Weast,R.C and Grasselli, J.G., ed(s)., CRC Press, Inc., Boca Raton, FL, 1989, 1. [all data]

Stephenson and Malanowski, 1987
Stephenson, Richard M.; Malanowski, Stanislaw, Handbook of the Thermodynamics of Organic Compounds, 1987, https://doi.org/10.1007/978-94-009-3173-2 . [all data]