Oxiniacic acid

Phase change data

Data compiled as indicated in comments:
ALS - Hussein Y. Afeefy, Joel F. Liebman, and Stephen E. Stein
AC - William E. Acree, Jr., James S. Chickos

Quantity Value Units Method Reference Comment
Δsub152.3 ± 1.9kJ/molVAcree, Tucker, et al., 1995ALS
Δsub152.3 ± 1.9kJ/molMEAcree Jr., 1995See also Abboud, Jimenez, et al., 1995.; AC

Gas phase thermochemistry data

Data compiled by: Hussein Y. Afeefy, Joel F. Liebman, and Stephen E. Stein

Quantity Value Units Method Reference Comment
Δfgas-225.1 ± 2.2kJ/molCcbAcree, Tucker, et al., 1995

Condensed phase thermochemistry data

Data compiled by: Hussein Y. Afeefy, Joel F. Liebman, and Stephen E. Stein

Quantity Value Units Method Reference Comment
Δfsolid-377.4 ± 1.1kJ/molCcbAcree, Tucker, et al., 1995
Quantity Value Units Method Reference Comment
Δcsolid-2698.2 ± 0.7kJ/molCcbAcree, Tucker, et al., 1995

References

Acree, Tucker, et al., 1995
Acree, W.E., Jr.; Tucker, S.A.; Ribeiro da Silva, M.D.M.C.; Matos, M.A.R.; Goncalves, J.M.; Ribeiro da Silva, M.A.V.; Pilcher, G., Enthalpies of combustion of 4-nitropyridine N-oxide and pyridine-3-carboxylic acid N-oxide: the dissociation enthalpies of the N-O bonds in pyridine N-oxide derivatives, J. Chem. Thermodyn., 1995, 27, 391-398. [all data]

Acree Jr., 1995
Acree Jr., Enthalpies of combustion of 4-nitropyridineN-oxide and pyridine-3-carboxylic acidN-oxide: the dissociation enthalpies of the N---O bonds in pyridineN-oxide derivatives, The Journal of Chemical Thermodynamics, 1995, 27, 4, 391-398, https://doi.org/10.1006/jcht.1995.0038 . [all data]

Abboud, Jimenez, et al., 1995
Abboud, J.-L.M.; Jimenez, P.; Roux, M.V.; Turrion, C.; Lopez-Mardomingo, C.; Podosenin, A.; Rogers, D.W.; Liebman, J.F., Interrelations of the energetics of amides and alkenes: enthalpies of formation of N,N-dimethyl dertivatives of pivalamide, 1-adamantylcarboxamide and benzamide, and of styrene and its a-, trans-β- and β,β-methylated derivates, J. Phys. Org. Chem., 1995, 8, 15-25. [all data]