Mecoprop methyl ester

Kovats' RI, non-polar column, isothermal

View large format table.

Column type Active phase Temperature (C) I Reference Comment
CapillaryOV-1160.1514.Erdmann, Rochholz, et al., 1992
CapillaryOV-1190.1538.Erdmann, Rochholz, et al., 1992
PackedDC-200165.1518.de Beer, van Peteghem, et al., 1978
PackedDC-200165.1519.de Beer, van Peteghem, et al., 1978

Kovats' RI, polar column, isothermal

View large format table.

Column type Active phase Temperature (C) I Reference Comment
PackedFFAP165.2115.de Beer, van Peteghem, et al., 1978Column length: 1.8 m
PackedFFAP165.2115.de Beer, van Peteghem, et al., 1978Column length: 1.8 m

References

Erdmann, Rochholz, et al., 1992
Erdmann, F.; Rochholz, G.; Schütz, H., Retention-indices on OV-1 of approximately 170 commonly used pesticides, Mikrochim. Acta, 1992, 106, 3-6, 219-226, https://doi.org/10.1007/BF01242093 . [all data]

de Beer, van Peteghem, et al., 1978
de Beer, J.; van Peteghem, C.; Heyndrickx, A., Comparative Study of the Gas-Liquid Chromatographic Behaviour of the Pentafluorobenzyl Esters and the Methyl Esters of Ten Chlorophenoxyalkyl Acids, J. Chromatogr., 1978, 157, 97-110, https://doi.org/10.1016/S0021-9673(00)92325-2 . [all data]