Quinoxaline, 2,3-dimethyl-

Condensed phase thermochemistry data

Data compiled by: Hussein Y. Afeefy, Joel F. Liebman, and Stephen E. Stein

Quantity Value Units Method Reference Comment
Δfsolid87.1 ± 2.4kJ/molCcbRibeiro da Silva, Morais, et al., 1996
Quantity Value Units Method Reference Comment
Δcsolid-5451.3 ± 2.0kJ/molCcbRibeiro da Silva, Morais, et al., 1996

References

Ribeiro da Silva, Morais, et al., 1996
Ribeiro da Silva, M.A.V.; Morais, V.M.F.; Matos, M.A.R.; Rio, C.M.A.; Piedade, G.M.G.S., Thermochemical and theoretical study of some methyldiazines, Struct. Chem., 1996, 7, 329-336. [all data]