Isoquinoline, 1-methoxy-

Reaction thermochemistry data

Data compiled by: Hussein Y. Afeefy, Joel F. Liebman, and Stephen E. Stein

Individual Reactions

Isoquinoline, 1-methoxy- = 1(2H)-Isoquinolinone, 2-methyl-

By formula: C10H9NO = C10H9NO

Quantity Value Units Method Reference Comment
Δr-58. ± 4.kJ/molCisoBeak, Woods, et al., 1972liquid phase
Δr-40. ± 10.kJ/molCisoBeak, Woods, et al., 1972gas phase

References

Beak, Woods, et al., 1972
Beak, P.; Woods, T.S.; Mueller, D.S., Equilibrium studies. Substituent effects on methoxpyridine-1-methylpyridone equilibriums, Tetrahedron, 1972, 28, 5507-5524. [all data]