1,3-Dichloro-2,4,6-trifluorobenzene

Gas phase ion energetics data

Data compiled by: Sharon G. Lias, Rhoda D. Levin, and Sherif A. Kafafi

Ionization energy determinations

IE (eV) Method Reference
9.37 ± 0.02PEMohraz, Maier, et al., 1980

References

Mohraz, Maier, et al., 1980
Mohraz, M.; Maier, J.P.; Heilbronner, E., He(I α) and He(Iα) photoelectron spectra of fluorinated chloro- and bromobenzenes, J. Electron Spectrosc. Relat. Phenom., 1980, 19, 429. [all data]