1,10-Dicarbadecaborane(10)

Gas phase ion energetics data

Data compiled by: Sharon G. Lias, Rhoda D. Levin, and Sherif A. Kafafi

Ionization energy determinations

IE (eV) Method Reference Comment
10.5PEFehlner, Wu, et al., 1980Vertical value

References

Fehlner, Wu, et al., 1980
Fehlner, T.P.; Wu, M.; Meneghelli, B.J.; Rudolph, R.W., Ultraviolet photoelectron spectroscopy of thiaboranes, Inorg. Chem., 1980, 19, 49. [all data]