Phosphoric acid, 7-chlorobicyclo[3.2.0]hepta-2,6-dien-6-yl dimethyl ester

Kovats' RI, non-polar column, isothermal

View large format table.

Column type Active phase Temperature (C) I Reference Comment
CapillaryOV-1130.1529.Erdmann, Rochholz, et al., 1992
CapillaryOV-1160.1539.Erdmann, Rochholz, et al., 1992
CapillaryOV-1190.1541.Erdmann, Rochholz, et al., 1992

Van Den Dool and Kratz RI, non-polar column, temperature ramp

View large format table.

Column type Active phase I Reference Comment
CapillarySLB-5MS1567.Mondello, Casilli, et al., 200730. m/0.25 mm/0.25 μm, He, 2. K/min; Tstart: 70. C; Tend: 300. C
CapillarySLB-5MS1572.Mondello, Casilli, et al., 200730. m/0.25 mm/0.25 μm, He, 2. K/min; Tstart: 70. C; Tend: 300. C

References

Erdmann, Rochholz, et al., 1992
Erdmann, F.; Rochholz, G.; Schütz, H., Retention-indices on OV-1 of approximately 170 commonly used pesticides, Mikrochim. Acta, 1992, 106, 3-6, 219-226, https://doi.org/10.1007/BF01242093 . [all data]

Mondello, Casilli, et al., 2007
Mondello, L.; Casilli, A.; Tranchida, P.Q.; Presti, M.L.; Dugo, P.; Dugo, G., Comprehensive gas chromatography coupled to mass spectrometry for the separation of pesticides in a very complex matrix, Anal. Bioanal. Chem., 2007, 389, 6, 1755-1763, https://doi.org/10.1007/s00216-007-1412-y . [all data]