1,4-Naphthalenedione, 2-methoxy-

Gas phase ion energetics data

Data compiled by: Sharon G. Lias and Joel F. Liebman

Ionization energy determinations

IE (eV) Method Reference Comment
9.0PEMillefiori, Gulino, et al., 1990
9.50PEMillefiori, Gulino, et al., 1990Vertical value

References

Millefiori, Gulino, et al., 1990
Millefiori, S.; Gulino, A.; Casarin, M., UV Photoelectron spectra, reduction potentials and MO calculations of intramolecularly hydrogen-bonded naphtoquinones, J. Chim. Phys., 1990, 87, 317. [all data]