2,2',2",2'",4,4',4",4'",6,6',6",6'"-Dodecanitroquatraphenyl

Condensed phase thermochemistry data

Data compiled by: Hussein Y. Afeefy, Joel F. Liebman, and Stephen E. Stein

Quantity Value Units Method Reference Comment
Δfsolid213. ± 10.kJ/molCcbRouse, 1976
Quantity Value Units Method Reference Comment
Δcsolid-10515. ± 4.kJ/molCcbRouse, 1976

References

Rouse, 1976
Rouse, P.E., Jr., Enthalpies of formation and calculated detonation properties of some thermally stable explosives, J. Chem. Eng. Data, 1976, 21, 16-20. [all data]