N,N-Difluorobenzylamine

Gas phase thermochemistry data

Data compiled by: Hussein Y. Afeefy, Joel F. Liebman, and Stephen E. Stein

Quantity Value Units Method Reference Comment
Δfgas7. ± 4.kJ/molCcbPepekin, Lebedev, et al., 1969Corrected for CODATA value of ΔfH

Phase change data

Data compiled as indicated in comments:
ALS - Hussein Y. Afeefy, Joel F. Liebman, and Stephen E. Stein
AC - William E. Acree, Jr., James S. Chickos

Quantity Value Units Method Reference Comment
Δvap10.6 ± 0.3kcal/molVPepekin, Lebedev, et al., 1969Corrected for CODATA value of ΔfH; ALS

Enthalpy of vaporization

ΔvapH (kcal/mol) Temperature (K) Method Reference Comment
18.6323.AStephenson and Malanowski, 1987Based on data from 313. - 333. K.; AC

References

Pepekin, Lebedev, et al., 1969
Pepekin, V.I.; Lebedev, Yu.A.; Rozantsev, G.G.; Faynzil'berg, A.A.; Apin, A.Ya., The enthalpy of formation of N,N-difluorobenzylamine, Bull. Acad. Sci. USSR, Div. Chem. Sci., 1969, 399-400, In original 452. [all data]