2-Thiophenemethanol, α-methyl-

Van Den Dool and Kratz RI, non-polar column, temperature ramp

View large format table.

Column type Active phase I Reference Comment
CapillaryOV-1011054.Misharina, Vitt, et al., 1986He, 40. C @ 4. min, 2. K/min; Column length: 50. m; Column diameter: 0.32 mm; Tend: 250. C

References

Misharina, Vitt, et al., 1986
Misharina, T.A.; Vitt, S.V.; Golovnya, R.V.; Belikov, V.M., The use of chemical modification for combined chromatographic-mass spectrometric identification of isomeric thiophene and furan substances, Zh. Anal. Khim., 1986, 61, 10, 1876-1881. [all data]