Tofisopam

Kovats' RI, non-polar column, custom temperature program

View large format table.

Column type Active phase I Reference Comment
CapillaryOV-13055.Schütz, 1988Program: not specified

References

Schütz, 1988
Schütz, H., Modern screening strategies in analytical toxicology with special regard to new benzodiazepines, Z. Rechtsmed., 1988, 100, 1, 19-37, https://doi.org/10.1007/BF00200362 . [all data]