Cyclohexene, 4-(1,1-dimethylethyl)-

Phase change data

Data compiled by: Thermodynamics Research Center, NIST Boulder Laboratories, Chris Muzny director

Quantity Value Units Method Reference Comment
Tboil436.KN/AStork and White, 1956Uncertainty assigned by TRC = 4. K

In addition to the Thermodynamics Research Center (TRC) data available from this site, much more physical and chemical property data is available from the following TRC products:

References

Stork and White, 1956
Stork, G.; White, W.N., The Stereochemistry of the SN2' Reaction II., J. Am. Chem. Soc., 1956, 78, 4609. [all data]