Perfluorohxamethyl benzvalene

Phase change data

Data compiled by: William E. Acree, Jr., James S. Chickos

Enthalpy of vaporization

ΔvapH (kJ/mol) Temperature (K) Method Reference Comment
38.6308.AStephenson and Malanowski, 1987Based on data from 293. - 353. K. See also Barlow, Haszeldine, et al., 1970 and Dykyj, Svoboda, et al., 1999.

References

Stephenson and Malanowski, 1987
Stephenson, Richard M.; Malanowski, Stanislaw, Handbook of the Thermodynamics of Organic Compounds, 1987, https://doi.org/10.1007/978-94-009-3173-2 . [all data]

Barlow, Haszeldine, et al., 1970
Barlow, M.G.; Haszeldine, R.N.; Hubbard, R., Valence-bond isomer chemistry. Part I. The valence-bond isomers of hexakis(trifluoromethyl)- and hexakis(pentafluoroethyl)-benzenes, J. Chem. Soc., C, 1970, 9, 1232, https://doi.org/10.1039/j39700001232 . [all data]

Dykyj, Svoboda, et al., 1999
Dykyj, J.; Svoboda, J.; Wilhoit, R.C.; Frenkel, M.L.; Hall, K.R., Vapor Pressure of Chemicals: Part A. Vapor Pressure and Antoine Constants for Hydrocarbons and Sulfur, Selenium, Tellurium and Hydrogen Containing Organic Compounds, Springer, Berlin, 1999, 373. [all data]