1,15-Hexadecadiene

Kovats' RI, non-polar column, isothermal

View large format table.

Column type Active phase Temperature (C) I Reference Comment
PackedSE-30175.1577.Casteignau and Villessot, 1968Column length: 3. m

Kovats' RI, polar column, isothermal

View large format table.

Column type Active phase Temperature (C) I Reference Comment
PackedCarbowax 20M175.1708.Casteignau and Villessot, 1968Column length: 3. m

Normal alkane RI, non-polar column, temperature ramp

View large format table.

Column type Active phase I Reference Comment
CapillaryPetrocol DH1581.Sojak, Kubinec, et al., 2006150. m/0.25 mm/1.0 μm, 1. K/min; Tstart: 40. C; Tend: 300. C

References

Casteignau and Villessot, 1968
Casteignau, G.; Villessot, D., Identification par chromatographie en phase gaseuse de composés difonctionnels insaturés. I. Synthèse et indices de rétention, Bull. Soc. Chim. Fr., 1968, 9, 3893-3903. [all data]

Sojak, Kubinec, et al., 2006
Sojak, L.; Kubinec, R.; Jurdakova, H.; Hajekova, E.; Bajus, M., GC-MS of polyethylene and polypropylene thermal cracking produxts, Petroleum Coal, 2006, 48, 1, 1-14. [all data]