Butanoic acid, 3-butenyl ester

Kovats' RI, non-polar column, isothermal

View large format table.

Column type Active phase Temperature (C) I Reference Comment
CapillarySE-30100.971.Haken, Madden, et al., 1985N2; Column length: 25. m; Column diameter: 0.33 mm
CapillarySE-30120.941.Haken, Madden, et al., 1985N2; Column length: 25. m; Column diameter: 0.33 mm
CapillarySE-30140.961.Haken, Madden, et al., 1985N2; Column length: 25. m; Column diameter: 0.33 mm
CapillarySE-30160.972.Haken, Madden, et al., 1985N2; Column length: 25. m; Column diameter: 0.33 mm

References

Haken, Madden, et al., 1985
Haken, J.K.; Madden, B.G.; Korhonen, I.O.O., Gas chromatography of homologous esters. XXXI. Butanoyl and monochlorobutanoyl esters of lower saturated branched chain and unsaturated alcohols on SE-30 and OV-351 capillary columns, J. Chromatogr., 1985, 325, 61-73, https://doi.org/10.1016/S0021-9673(00)96008-4 . [all data]