di-tert-butyl sec-butylidene diperoxide

Condensed phase thermochemistry data

Data compiled by: Hussein Y. Afeefy, Joel F. Liebman, and Stephen E. Stein

Quantity Value Units Method Reference Comment
Δcliquid-7821.2 ± 6.3kJ/molCcbDickey, Raley, et al., 1949Corresponding Δfliquid = -616.7 kJ/mol (simple calculation by NIST; no Washburn corrections)

References

Dickey, Raley, et al., 1949
Dickey, F.H.; Raley, J.H.; Rust, F.F.; Treseder, R.S.; Vaughan, W.E., Di-tert-butyl peroxide and 2,2-bis(tert-butylperoxy)butane. Preparation, analysis, and properties., Ind. Eng. Chem., 1949, 41, 1673-1679. [all data]