Cobalt carbonyl tris(phosphorus trifluoride)hydride

Gas phase ion energetics data

Data compiled by: Henry M. Rosenstock, Keith Draxl, Bruce W. Steiner, and John T. Herron

Ionization energy determinations

IE (eV) Method Reference
10.2 ± 0.1EISaalfeld, McDowell, et al., 1968

Appearance energy determinations

Ion AE (eV) Other Products MethodReferenceComment
COF3PCo+14.1 ± 0.3?EISaalfeld, McDowell, et al., 1968
CoCO+15.9 ± 0.2?EISaalfeld, McDowell, et al., 1968
CHOF3PCo+12.3 ± 0.3?EISaalfeld, McDowell, et al., 1968
CHOF6P2Co+10.4 ± 0.3?EISaalfeld, McDowell, et al., 1968
CHOCo+12.0 ± 0.2?EISaalfeld, McDowell, et al., 1968
Co+17.8 ± 0.3?EISaalfeld, McDowell, et al., 1968
CoHPF3+13.6 ± 0.2?EISaalfeld, McDowell, et al., 1968
CoPF3+15.7 ± 0.5?EISaalfeld, McDowell, et al., 1968
CoHP2F6+12.6 ± 0.2?EISaalfeld, McDowell, et al., 1968
CoP2F6+14.5 ± 0.2?EISaalfeld, McDowell, et al., 1968
CoHP3F9+11.1 ± 0.2COEISaalfeld, McDowell, et al., 1968
CoH+15.6 ± 0.3?EISaalfeld, McDowell, et al., 1968

References

Saalfeld, McDowell, et al., 1968
Saalfeld, F.E.; McDowell, M.V.; Gondal, S.K.; MacDiarmid, A.G., The mass spectra of trifluorophosphinecarbonylcobalt hydrides, J. Am. Chem. Soc., 1968, 90, 3684. [all data]