Phosphine oxide, methyldiphenyl-

Phase change data

Data compiled by: William E. Acree, Jr., James S. Chickos

Enthalpy of fusion

ΔfusH (kJ/mol) Temperature (K) Method Reference
20.37385.4DSCHu, Wang, et al., 2010

References

Hu, Wang, et al., 2010
Hu, Fu-Heng; Wang, Li-Sheng; Cai, Shuang-Fei, Solubilities of Methyldiphenylphosphine Oxide in Selected Solvents, J. Chem. Eng. Data, 2010, 55, 1, 492-495, https://doi.org/10.1021/je900277m . [all data]