isobutyl-n-butyl-amine

Kovats' RI, non-polar column, isothermal

View large format table.

Column type Active phase Temperature (C) I Reference Comment
PackedApiezon L100.898.Golovnya, Zhuravleva, et al., 1981N2, Chromosorb GAW; Column length: 2.7 m

Kovats' RI, polar column, isothermal

View large format table.

Column type Active phase Temperature (C) I Reference Comment
CapillaryPEG-40M+KF110.1014.Svetlova, Samusenko, et al., 1986

Phase change data

Data compiled as indicated in comments:
DRB - Donald R. Burgess, Jr.
AC - William E. Acree, Jr., James S. Chickos
ALS - Hussein Y. Afeefy, Joel F. Liebman, and Stephen E. Stein

Quantity Value Units Method Reference Comment
Δvap41.0kJ/molN/ABedford, Edmondson, et al., 1962DRB

Enthalpy of vaporization

ΔvapH (kJ/mol) Temperature (K) Method Reference Comment
41.2328.AStephenson and Malanowski, 1987Based on data from 313. - 423. K.; AC
41. ± 1.313.VBedford, Edmondson, et al., 1962ALS

Condensed phase thermochemistry data

Data compiled by: Hussein Y. Afeefy, Joel F. Liebman, and Stephen E. Stein

Quantity Value Units Method Reference Comment
Δfliquid-216. ± 5.0kJ/molCcbBedford, Edmondson, et al., 1962
Quantity Value Units Method Reference Comment
Δcliquid-5647.7 ± 5.2kJ/molCcbBedford, Edmondson, et al., 1962

References

Golovnya, Zhuravleva, et al., 1981
Golovnya, R.V.; Zhuravleva, I.L.; Svetlova, N.I.; Grigor'eva, D.N.; Terenina, M.B.; Gutnik, S.B., Gas-chromatographic behavior of secondary isoaliphatic and alicyclic amines, J. Anal. Chem. USSR (Engl. Transl.), 1981, 36, 4, 501-505. [all data]

Svetlova, Samusenko, et al., 1986
Svetlova, N.I.; Samusenko, A.L.; Golovnya, R.V., Advantage of the universal equation over the linear equation for the calculation of retention parameters of homologous series in capillary chromatography, J. Hi. Res. Chromatogr. Chromatogr. Comm., 1986, 9, 12, 737-740, https://doi.org/10.1002/jhrc.1240091205 . [all data]