Zinc(II) n-hexanoate

Phase change data

Data compiled by: Eugene S. Domalski and Elizabeth D. Hearing

Enthalpy of phase transition

ΔHtrs (kJ/mol) Temperature (K) Initial Phase Final Phase Reference Comment
7.000353.crystaline, IIIcrystaline, IIKonkoly-Thege, Ruff, et al., 1978
6.400378.crystaline, IIcrystaline, IKonkoly-Thege, Ruff, et al., 1978
26.000418.crystaline, IliquidKonkoly-Thege, Ruff, et al., 1978

Entropy of phase transition

ΔStrs (J/mol*K) Temperature (K) Initial Phase Final Phase Reference Comment
62.418.crystaline, IliquidKonkoly-Thege, Ruff, et al., 1978

References

Konkoly-Thege, Ruff, et al., 1978
Konkoly-Thege, I.; Ruff, I.; Adeosun, S.O.; Sime, S.J., Properties of molten carboxylates. Part 6. A quantitative differential thermal analysis study of phase transitions in some zinc and cadmium carboxylates, Thermochim. Acta, 1978, 24, 89-96. [all data]