3-Buten-2-one, 4-(2-chlorophenyl)-

Gas phase ion energetics data

Data compiled as indicated in comments:
LLK - Sharon G. Lias, Rhoda D. Levin, and Sherif A. Kafafi

Ionization energy determinations

IE (eV) Method Reference Comment
8.8EISchaldach, Grotemeyer, et al., 1981LLK
8.8EIGrutzmacher, Schaldach, et al., 1980LLK
8.8 ± 0.1EISchaldach and Grutzmacher, 1979LLK

Appearance energy determinations

Ion AE (eV) Other Products MethodReferenceComment
C10H9O+9.3ClEIGrutzmacher, Schaldach, et al., 1980LLK
C10H9O+9.3 ± 0.2ClEISchaldach and Grutzmacher, 1979LLK

References

Schaldach, Grotemeyer, et al., 1981
Schaldach, B.; Grotemeyer, B.; Grotemeyer, J.; Grutzmacher, H.-F., Kinetic and thermodynamic effects on intramolecular aromatic substitution in meta and para substituted benzalacetones, Org. Mass Spectrom., 1981, 16, 410. [all data]

Grutzmacher, Schaldach, et al., 1980
Grutzmacher, H.-F.; Schaldach, B.; Schubert, R.; Ramana, D.V., Ion kinetic energy release as a transition state probe in intramolecular aromatic substitutions, Adv. Mass Spectrom., 1980, 8, 795. [all data]

Schaldach and Grutzmacher, 1979
Schaldach, B.; Grutzmacher, H.F., Kinetics energy release and position of the transition state during the intramolecular substitution of ionized benzalacetones, Int. J. Mass Spectrom. Ion Phys., 1979, 31, 271. [all data]