2-Methylnaphth[2,3-d]oxazole

Condensed phase thermochemistry data

Data compiled by: Hussein Y. Afeefy, Joel F. Liebman, and Stephen E. Stein

Quantity Value Units Method Reference Comment
Δcsolid-5955.9 ± 8.8kJ/molCcbFries, Walter, et al., 1935Reanalyzed by Cox and Pilcher, 1970, Original value = -5953.8 kJ/mol

References

Fries, Walter, et al., 1935
Fries, K.; Walter, R.; Schilling, K., Uber tricyclische verbindungen in denen naphtalin mit einem heterocyclus anelliert ist, Ann. Chim., 1935, 516, 248-285. [all data]

Cox and Pilcher, 1970
Cox, J.D.; Pilcher, G., Thermochemistry of Organic and Organometallic Compounds, Academic Press, New York, 1970, 1-636. [all data]