Benzoyl(cyclohexyloxy)-carbonylperoxide

Phase change data

Data compiled as indicated in comments:
DRB - Donald R. Burgess, Jr.
AC - William E. Acree, Jr., James S. Chickos

Quantity Value Units Method Reference Comment
Δsub96.2kJ/molN/AKiparisova and Rabinovich, 1971DRB

Enthalpy of sublimation

ΔsubH (kJ/mol) Temperature (K) Method Reference Comment
96.2 ± 4.2303.MEKiparisova and Rabinovich, 1971, 2Based on data from 293. - 313. K. See also Pedley and Rylance, 1977.; AC

References

Kiparisova and Rabinovich, 1971
Kiparisova, E.G.; Rabinovich, I.B., Thermochemistry of a series of acyl peroxides, Dokl. Phys. Chem. (Engl. Transl.), 1971, 199, 675-677, In original 1075. [all data]

Kiparisova and Rabinovich, 1971, 2
Kiparisova, E.G.; Rabinovich, I.B., Dokl. Akad. Nauk SSSR, 1971, 199, 5, 1075. [all data]

Pedley and Rylance, 1977
Pedley, J.B.; Rylance, J., , Computer Analysed Thermochemical Data: Organic and Organometallic Compounds, University of Sussex, Brighton, 1977. [all data]