1,4-Dibora-2,5-cyclohexadiene, 1,4-difluoro-2,3,5,6-tetramethyl-

Gas phase ion energetics data

Data compiled by: Sharon G. Lias, Rhoda D. Levin, and Sherif A. Kafafi

Ionization energy determinations

IE (eV) Method Reference Comment
8.47PEBock, Kaim, et al., 1980
8.72PEBock, Kaim, et al., 1980Vertical value

References

Bock, Kaim, et al., 1980
Bock, H.; Kaim, W.; Timms, P.L.; Hawker, P., Durosemiquinone and its BF analogue - detection of 1,4-diborine as an unexpected elimination product, Chem. Ber., 1980, 113, 3196. [all data]