1H-Pyrrole, 1-(phenylmethyl)-

Phase change data

Data compiled as indicated in comments:
BS - Robert L. Brown and Stephen E. Stein
TRC - Thermodynamics Research Center, NIST Boulder Laboratories, Chris Muzny director

Quantity Value Units Method Reference Comment
Tfus288.KN/AAdkins and Coonradt, 1941Uncertainty assigned by TRC = 2. K; TRC

Reduced pressure boiling point

Tboil (K) Pressure (bar) Reference Comment
411.20.036Weast and Grasselli, 1989BS

In addition to the Thermodynamics Research Center (TRC) data available from this site, much more physical and chemical property data is available from the following TRC products:

References

Adkins and Coonradt, 1941
Adkins, H.; Coonradt, H.L., The Selective Hydrogenation of Derivatives of Pyrrole, Indole, Carbazole and Acridine, J. Am. Chem. Soc., 1941, 63, 1563-70. [all data]

Weast and Grasselli, 1989
CRC Handbook of Data on Organic Compounds, 2nd Editon, Weast,R.C and Grasselli, J.G., ed(s)., CRC Press, Inc., Boca Raton, FL, 1989, 1. [all data]