2-Octene, 2,7-dimethyl-

Phase change data

Data compiled by: Thermodynamics Research Center, NIST Boulder Laboratories, Chris Muzny director

Quantity Value Units Method Reference Comment
Tboil435.KN/AWard and Fulweiler, 1934Uncertainty assigned by TRC = 6. K; identification of isomer not certain
Tboil430.15KN/ABrooks and Humphrey, 1918Uncertainty assigned by TRC = 2. K
Quantity Value Units Method Reference Comment
Tfus193.7KN/AWard and Fulweiler, 1934Uncertainty assigned by TRC = 5. K; identification of isomer not certain

In addition to the Thermodynamics Research Center (TRC) data available from this site, much more physical and chemical property data is available from the following TRC products:

References

Ward and Fulweiler, 1934
Ward, A.L.; Fulweiler, W.H., Note on a New Method for the Preparation of Acyclic Unsaturated Hydrocarbon, J. Am. Chem. Soc., 1934, 56, 1641. [all data]

Brooks and Humphrey, 1918
Brooks, B.T.; Humphrey, I., The Action of Concentrated Sulfuric Acid on Olefins, with Particular Reference to the Refining of Petroleum Distillates, J. Am. Chem. Soc., 1918, 40, 822. [all data]