Hydrazine, 4TMS derivative

Gas phase ion energetics data

Data compiled by: Sharon G. Lias, Rhoda D. Levin, and Sherif A. Kafafi

Ionization energy determinations

IE (eV) Method Reference Comment
~7.95PEBock, Kaim, et al., 1980Vertical value

References

Bock, Kaim, et al., 1980
Bock, H.; Kaim, W.; Noth, H.; Semkow, A., A radical ions. 36. Structural changes accompanying the one-electron oxidation of hydrazine and its silyl derivatives, J. Am. Chem. Soc., 1980, 102, 4421. [all data]