2-Cyclopropen-1-one,2,3-bis(1,1-dimethylethyl)-

Gas phase ion energetics data

Data compiled by: Sharon G. Lias, Rhoda D. Levin, and Sherif A. Kafafi

Ionization energy determinations

IE (eV) Method Reference Comment
8.36PEDehmlow, Dehmlow, et al., 1977Vertical value
8.23PESchafer, Schweig, et al., 1974Vertical value

References

Dehmlow, Dehmlow, et al., 1977
Dehmlow, E.V.; Dehmlow, S.S.; Marschner, F., Chemische und photoelektronenspektroskopische Eigenschaften von cyclopropylsubstituierten Cyclopropenonen, Chem. Ber., 1977, 110, 154. [all data]

Schafer, Schweig, et al., 1974
Schafer, W.; Schweig, A.; Maier, G.; Sayrac, T.; Crandall, J.K., Electronic structure of cyclopropenone, Tetrahedron Lett., 1974, 13, 1213. [all data]