Cedrane, 8-propoxy-

Normal alkane RI, non-polar column, temperature ramp

View large format table.

Column type Active phase I Reference Comment
CapillaryCP Sil 8 CB1652.Suárez, Vásquez, et al., 2005He, 60. C @ 5. min, 3. K/min; Column length: 30. m; Column diameter: 0.25 mm; Tend: 290. C

References

Suárez, Vásquez, et al., 2005
Suárez, A.I.; Vásquez, L.J.; Manzano, M.A.; Compagnone, R.S., Essential oil composition of Croton cuneatus and Croton malambo growing in Venezuela, Flavour Fragr. J., 2005, 20, 6, 611-614, https://doi.org/10.1002/ffj.1498 . [all data]