1,3-Butadiene, 1-ethoxy-, (E)

Reaction thermochemistry data

Data compiled by: Hussein Y. Afeefy, Joel F. Liebman, and Stephen E. Stein

Individual Reactions

cis-1,3-Butadien-1-yl ethyl ether = 1,3-Butadiene, 1-ethoxy-, (E)

By formula: C6H10O = C6H10O

Quantity Value Units Method Reference Comment
Δr3.0 ± 0.4kJ/molEqkTaskinen and Kalva, 1975liquid phase; solvent: Neat liquid; Between 300-400 K
Δr-3.87 ± 0.25kJ/molEqkOkuyama, Fueno, et al., 1969liquid phase; GC

References

Taskinen and Kalva, 1975
Taskinen, E.; Kalva, H., Thermodynamics of vinyl ethers. Part XVI. Some β-substituted vinyl alkyl ethers, Finn. Chem. Lett., 1975, 208-210. [all data]

Okuyama, Fueno, et al., 1969
Okuyama, T.; Fueno, T.; Furukawa, J., Structure and reactivity of α,β-unsaturated ethers. 9. Cis-trans isomerization equilibriums in the liquid phase, Tetrahedron, 1969, 25, 5409-5414. [all data]