3,4-dimethylvaleraldehyde

Phase change data

Data compiled by: William E. Acree, Jr., James S. Chickos

Enthalpy of vaporization

ΔvapH (kJ/mol) Temperature (K) Method Reference Comment
42.4334.EBMills and Fenton, 1987Based on data from 319. - 417. K.

References

Mills and Fenton, 1987
Mills, P.L.; Fenton, R.L., Vapor pressures, liquid densities, liquid heat capacities, and ideal gas thermodynamic properties for 3-methylhexanal and 3,4-dimethylpentanal, J. Chem. Eng. Data, 1987, 32, 266-273. [all data]